Target
Cathepsin K
Ligand
BDBM50098576
Substrate
Meas. Tech.
ChEMBL_216702 (CHEMBL820314)
IC50
30±n/a nM
Target
Name:
Cathepsin K
Synonyms:
CATK_HUMAN CTSO Cathepsin O Cathepsin X
Type:
Enzyme
Mol. Mass.:
36975.68
Organism:
Homo sapiens (Human)
Description:
P43235
Residue:
329
  
Inhibitor
Name:
BDBM50098576
Synonyms:
5-(2-MORPHOLIN-4-YLETHOXY)BENZOFURAN-2-CARBOXYLIC ACID ((S)-3-METHYL-1-{(S)-3-OXO-1-[2-(3-PYRIDIN-2-YLPHENYL)ACETYL]AZEPAN-4-YLCARBAMOYL}BUTYL)AMIDE CHEMBL284939
Type:
Small organic molecule
Emp. Form.:
C40H47N5O7
Mol. Mass.:
709.8305
SMILES:
CC(C)C[C@H](NC(=O)c1cc2cc(OCCN3CCOCC3)ccc2o1)C(=O)N[C@H]1CCCN(CC1=O)C(=O)Cc1cccc(c1)-c1ccccn1
: