Target
C-C chemokine receptor type 1
Ligand
BDBM50098635
Substrate
Meas. Tech.
ChEMBL_218695 (CHEMBL821481)
IC50
2500±n/a nM
Citation
 Naya, ASagara, YOhwaki, KSaeki, TIchikawa, DIwasawa, YNoguchi, KOhtake, N Design, synthesis, and discovery of a novel CCR1 antagonist. J Med Chem 44:1429-35 (2001)  
Target
Name:
C-C chemokine receptor type 1
Synonyms:
C-C CKR-1 CCR-1 CD_antigen=CD191 Cmkbr1 Macrophage inflammatory protein 1-alpha receptor | RANTES-R
Type:
PROTEIN
Mol. Mass.:
40904.59
Organism:
Mus musculus
Description:
ChEMBL_1452291
Residue:
355
  
Inhibitor
Name:
BDBM50098635
Synonyms:
2,7-Dibromo-9H-xanthene-9-carboxylic acid (1-cyclooct-1-enylmethyl-piperidin-4-yl)-amide | CHEMBL33580
Type:
Small organic molecule
Emp. Form.:
C28H32Br2N2O2
Mol. Mass.:
588.374
SMILES:
Brc1ccc2Oc3ccc(Br)cc3C(C(=O)NC3CCN(C\C4=C\CCCCCC4)CC3)c2c1
: