Target
C-C chemokine receptor type 1
Ligand
BDBM50098642
Substrate
Meas. Tech.
ChEMBL_218695 (CHEMBL821481)
IC50
380±n/a nM
Citation
 Naya, ASagara, YOhwaki, KSaeki, TIchikawa, DIwasawa, YNoguchi, KOhtake, N Design, synthesis, and discovery of a novel CCR1 antagonist. J Med Chem 44:1429-35 (2001)  
Target
Name:
C-C chemokine receptor type 1
Synonyms:
C-C CKR-1 CCR-1 CD_antigen=CD191 Cmkbr1 Macrophage inflammatory protein 1-alpha receptor | RANTES-R
Type:
PROTEIN
Mol. Mass.:
40904.59
Organism:
Mus musculus
Description:
ChEMBL_1452291
Residue:
355
  
Inhibitor
Name:
BDBM50098642
Synonyms:
1-Butyl-1-cyclooctylmethyl-4-[(9H-xanthene-9-carbonyl)-amino]-piperidinium; iodide | CHEMBL32713
Type:
Small organic molecule
Emp. Form.:
C32H45N2O2
Mol. Mass.:
489.7114
SMILES:
CCCC[N+]1(CC2CCCCCCC2)CCC(CC1)NC(=O)C1c2ccccc2Oc2ccccc12
: