Target
Metallo-beta-lactamase type 2
Ligand
BDBM50099187
Substrate
Meas. Tech.
ChEBML_48697
IC50
>100000±n/a nM
Citation
 Sandanayaka, VPFeigelson, GBPrashad, ASYang, YPetersen, PJ Allyl and propargyl substituted penam sulfones as versatile intermediates toward the syntheses of new beta-lactamase inhibitors. Bioorg Med Chem Lett 11:997-1000 (2001)  
Target
Name:
Metallo-beta-lactamase type 2
Synonyms:
BLAB_BACFG ccrA | cfiA
Type:
PROTEIN
Mol. Mass.:
27252.87
Organism:
Bacteroides fragilis
Description:
ChEMBL_1502123
Residue:
249
  
Inhibitor
Name:
BDBM50099187
Synonyms:
(2S,5R)-6-[(E)-3-(Methoxy-methyl-carbamoyl)-allyl]-3,3-dimethyl-4,7-dioxo-4lambda*4*-thia-1-aza-bicyclo[3.2.0]heptane-2-carboxylic acid | CHEMBL267627
Type:
Small organic molecule
Emp. Form.:
C14H20N2O6S
Mol. Mass.:
344.383
SMILES:
CON(C)C(=O)\C=C\CC1[C@@H]2N([C@@H](C(O)=O)C(C)(C)S2=O)C1=O
: