Target
Metallo-beta-lactamase type 2
Ligand
BDBM50099195
Substrate
Meas. Tech.
ChEBML_48697
IC50
71000±n/a nM
Citation
 Sandanayaka, VPFeigelson, GBPrashad, ASYang, YPetersen, PJ Allyl and propargyl substituted penam sulfones as versatile intermediates toward the syntheses of new beta-lactamase inhibitors. Bioorg Med Chem Lett 11:997-1000 (2001)  
Target
Name:
Metallo-beta-lactamase type 2
Synonyms:
BLAB_BACFG ccrA | cfiA
Type:
PROTEIN
Mol. Mass.:
27252.87
Organism:
Bacteroides fragilis
Description:
ChEMBL_1502123
Residue:
249
  
Inhibitor
Name:
BDBM50099195
Synonyms:
(2S,5R)-3,3-Dimethyl-4,4,7-trioxo-6-((E)-4-oxo-pent-2-enyl)-4lambda*6*-thia-1-aza-bicyclo[3.2.0]heptane-2-carboxylic acid | CHEMBL6301
Type:
Small organic molecule
Emp. Form.:
C13H17NO6S
Mol. Mass.:
315.342
SMILES:
CC(=O)CC=CC1[C@@H]2N([C@@H](C(O)=O)C(C)(C)S2(=O)=O)C1=O
: