Target
Glutamate carboxypeptidase 2
Ligand
BDBM50099217
Substrate
Meas. Tech.
ChEMBL_158618 (CHEMBL765764)
IC50
24300±n/a nM
Citation
 Adlington, RMBaldwin, JEBecker, GWChen, BCheng, LCooper, SLHermann, RBHowe, TJMcCoull, WMcNulty, AMNeubauer, BLPritchard, GJ Design, synthesis, and proposed active site binding analysis of monocyclic 2-azetidinone inhibitors of prostate specific antigen. J Med Chem 44:1491-508 (2001)  
Target
Name:
Glutamate carboxypeptidase 2
Synonyms:
FGCP FOLH1 Folate hydrolase 1 Glutamate carboxypeptidase 2 Membrane glutamate carboxypeptidase NAALAD1 PSM Prostate-specific membrane antigen mGCP
Type:
PROTEIN
Mol. Mass.:
84333.66
Organism:
Homo sapiens (Human)
Description:
ChEMBL_1497035
Residue:
750
  
Inhibitor
Name:
BDBM50099217
Synonyms:
1-Benzoyl-3-benzyl-4-oxo-azetidine-2-carboxylic acid 4-carboxy-benzyl ester | CHEMBL37038
Type:
Small organic molecule
Emp. Form.:
C26H21NO6
Mol. Mass.:
443.448
SMILES:
OC(=O)c1ccc(COC(=O)[C@@H]2[C@H](Cc3ccccc3)C(=O)N2C(=O)c2ccccc2)cc1
: