Target
Glutamate carboxypeptidase 2
Ligand
BDBM50099220
Substrate
Meas. Tech.
ChEMBL_158618 (CHEMBL765764)
IC50
11500±n/a nM
Citation
 Adlington, RMBaldwin, JEBecker, GWChen, BCheng, LCooper, SLHermann, RBHowe, TJMcCoull, WMcNulty, AMNeubauer, BLPritchard, GJ Design, synthesis, and proposed active site binding analysis of monocyclic 2-azetidinone inhibitors of prostate specific antigen. J Med Chem 44:1491-508 (2001)  
Target
Name:
Glutamate carboxypeptidase 2
Synonyms:
FGCP FOLH1 Folate hydrolase 1 Glutamate carboxypeptidase 2 Membrane glutamate carboxypeptidase NAALAD1 PSM Prostate-specific membrane antigen mGCP
Type:
PROTEIN
Mol. Mass.:
84333.66
Organism:
Homo sapiens (Human)
Description:
ChEMBL_1497035
Residue:
750
  
Inhibitor
Name:
BDBM50099220
Synonyms:
Benzoic acid 3-benzyl-1-(4-nitro-benzenesulfonyl)-4-oxo-azetidin-2-ylmethyl ester | CHEMBL36676
Type:
Small organic molecule
Emp. Form.:
C24H20N2O7S
Mol. Mass.:
480.49
SMILES:
[O-][N+](=O)c1ccc(cc1)S(=O)(=O)N1[C@H](COC(=O)c2ccccc2)[C@H](Cc2ccccc2)C1=O
: