Target
Glutamate carboxypeptidase 2
Ligand
BDBM50099216
Substrate
Meas. Tech.
ChEMBL_158618 (CHEMBL765764)
IC50
348±n/a nM
Citation
 Adlington, RMBaldwin, JEBecker, GWChen, BCheng, LCooper, SLHermann, RBHowe, TJMcCoull, WMcNulty, AMNeubauer, BLPritchard, GJ Design, synthesis, and proposed active site binding analysis of monocyclic 2-azetidinone inhibitors of prostate specific antigen. J Med Chem 44:1491-508 (2001)  
Target
Name:
Glutamate carboxypeptidase 2
Synonyms:
FGCP FOLH1 Folate hydrolase 1 Glutamate carboxypeptidase 2 Membrane glutamate carboxypeptidase NAALAD1 PSM Prostate-specific membrane antigen mGCP
Type:
PROTEIN
Mol. Mass.:
84333.66
Organism:
Homo sapiens (Human)
Description:
ChEMBL_1497035
Residue:
750
  
Inhibitor
Name:
BDBM50099216
Synonyms:
(2S,3S)-1-[2-(3-Benzyloxycarbonyl-phenyl)-acetyl]-3-(4-hydroxy-benzyl)-4-oxo-azetidine-2-carboxylic acid benzyl ester CHEMBL286934
Type:
Small organic molecule
Emp. Form.:
C34H29NO7
Mol. Mass.:
563.5966
SMILES:
Oc1ccc(C[C@H]2[C@H](N(C(=O)Cc3cccc(c3)C(=O)OCc3ccccc3)C2=O)C(=O)OCc2ccccc2)cc1
: