Target
Estrogen receptor beta
Ligand
BDBM50099586
Substrate
Meas. Tech.
ChEMBL_67341 (CHEMBL677746)
IC50
242±n/a nM
Citation
 Miller, CPCollini, MDTran, BDHarris, HAKharode, YPMarzolf, JTMoran, RAHenderson, RABender, RHUnwalla, RJGreenberger, LMYardley, JPAbou-Gharbia, MALyttle, CRKomm, BS Design, synthesis, and preclinical characterization of novel, highly selective indole estrogens. J Med Chem 44:1654-7 (2001)  
Target
Name:
Estrogen receptor beta
Synonyms:
ER-beta ESR2_HUMAN Estradiol receptor beta (ERβ) Estrogen receptor (ER beta) Estrogen receptor beta (ER beta) NR3A2 estrogen beta
Type:
Protein
Mol. Mass.:
59238.43
Organism:
Homo sapiens (Human)
Description:
Q92731
Residue:
530
  
Inhibitor
Name:
BDBM50099586
Synonyms:
2-(4-Hydroxy-phenyl)-3-methyl-1-(6-pyrrolidin-1-yl-hexyl)-1H-indol-5-ol ZK-119010
Type:
Small organic molecule
Emp. Form.:
C25H32N2O2
Mol. Mass.:
392.5338
SMILES:
Cc1c(-c2ccc(O)cc2)n(CCCCCCN2CCCC2)c2ccc(O)cc12
: