Target
Tyrosine-protein phosphatase non-receptor type 13
Ligand
BDBM50099713
Substrate
Meas. Tech.
ChEMBL_68631 (CHEMBL680036)
IC50
600±n/a nM
Citation
 Urbanek, RASuchard, SJSteelman, GBKnappenberger, KSSygowski, LAVeale, CAChapdelaine, MJ Potent reversible inhibitors of the protein tyrosine phosphatase CD45. J Med Chem 44:1777-93 (2001)  
Target
Name:
Tyrosine-protein phosphatase non-receptor type 13
Synonyms:
FAP-1 Fas-associated protein-tyrosine phosphatase 1 (FAP1) PNP1 PTP1E PTPN13 Tyrosine-protein phosphatase non-receptor type 13 | Tyrosine-protein phosphatase non-receptor type 13 (FAP1)
Type:
Protein
Mol. Mass.:
276896.33
Organism:
Homo sapiens (Human)
Description:
Q12923
Residue:
2485
  
Inhibitor
Name:
BDBM50099713
Synonyms:
CHEMBL50878 | N-(9,10-Dioxo-9,10-dihydro-phenanthren-2-yl)-2-fluoro-benzamide
Type:
Small organic molecule
Emp. Form.:
C21H12FNO3
Mol. Mass.:
345.3233
SMILES:
Fc1ccccc1C(=O)Nc1ccc-2c(c1)C(=O)C(=O)c1ccccc-21
: