Target
D(2) dopamine receptor
Ligand
BDBM50099807
Substrate
Meas. Tech.
ChEMBL_62231 (CHEMBL675742)
Ki
0.05±n/a nM
Citation
 Huang, YLuedtke, RRFreeman, RAWu, LMach, RH Synthesis and structure-activity relationships of naphthamides as dopamine D3 receptor ligands. J Med Chem 44:1815-26 (2001)  
Target
Name:
D(2) dopamine receptor
Synonyms:
DOPAMINE D2 DOPAMINE D2 Short Dopamine D2 receptor Drd2
Type:
G Protein-Coupled Receptor (GPCR)
Mol. Mass.:
50931.60
Organism:
Rattus norvegicus (rat)
Description:
P61169
Residue:
444
  
Inhibitor
Name:
BDBM50099807
Synonyms:
CHEMBL54866 | N-(9-Benzyl-9-aza-bicyclo[3.3.1]non-3-yl)-5-iodo-2,3-dimethoxy-benzamide
Type:
Small organic molecule
Emp. Form.:
C24H29IN2O3
Mol. Mass.:
520.4031
SMILES:
COc1cc(I)cc(C(=O)NC2CC3CCCC(C2)N3Cc2ccccc2)c1OC
: