Target
D(1B) dopamine receptor
Ligand
BDBM50099888
Substrate
Meas. Tech.
ChEBML_61336
Ki
>10000±n/a nM
Citation
 Huang, YKegeles, LSBae, SHwang, DRoth, BLSavage, JELaruelle, M Synthesis of potent and selective dopamine D(4) antagonists as candidate radioligands. Bioorg Med Chem Lett 11:1375-7 (2001)  
Target
Name:
D(1B) dopamine receptor
Synonyms:
D(1B) dopamine receptor DRD5_RAT Dopamine D5 receptor Drd5
Type:
Enzyme Catalytic Domain
Mol. Mass.:
52827.88
Organism:
RAT
Description:
Dopamine D1B 0 RAT::P25115
Residue:
475
  
Inhibitor
Name:
BDBM50099888
Synonyms:
3-[4-(4-Ethyl-phenyl)-piperazin-1-ylmethyl]-1H-pyrrolo[2,3-b]pyridine | CHEMBL282829
Type:
Small organic molecule
Emp. Form.:
C20H24N4
Mol. Mass.:
320.4314
SMILES:
CCc1ccc(cc1)N1CCN(Cc2c[nH]c3ncccc23)CC1
: