Target
Dual specificity mitogen-activated protein kinase kinase 1/2
Ligand
BDBM50099963
Substrate
Meas. Tech.
ChEMBL_105685 (CHEMBL716467)
IC50
9700±n/a nM
Citation
 Cockerill, SStubberfield, CStables, JCarter, MGuntrip, SSmith, KMcKeown, SShaw, RTopley, PThomsen, LAffleck, KJowett, AHayes, DWillson, MWoollard, PSpalding, D Indazolylamino quinazolines and pyridopyrimidines as inhibitors of the EGFr and C-erbB-2. Bioorg Med Chem Lett 11:1401-5 (2001)  
Target
Name:
Dual specificity mitogen-activated protein kinase kinase 1/2
Synonyms:
Dual specificity mitogen-activated protein kinase kinase; MEK1/2 | p-MEK1/2
Type:
Mol. Mass.:
Description:
ASSAY_ID of ChEMBL is 795758
Components:
This complex has 2 components.
Component 1
Name:
Dual specificity mitogen-activated protein kinase kinase 2
Synonyms:
Dual specificity mitogen-activated protein kinase kinase 2 (MEK2) ERK activator kinase 2 MAP2K2 MAPKK 2 MKK2 PRKMK2 | VHL-MAP2K1/MAP2K2
Type:
Enzyme Catalytic Domain
Mol. Mass.:
44423.61
Organism:
Homo sapiens (Human)
Description:
gi_13489054
Residue:
400
  
Component 2
Name:
Dual specificity mitogen-activated protein kinase kinase 1
Synonyms:
Dual specificity mitogen-activated protein kinase (MEK) Dual specificity mitogen-activated protein kinase kinase 1 (MEK1) Dual specificity mitogen-activated protein kinase kinase MEK1/2 MAP kinase kinase 1 MAPK/ERK kinase 1 MEK-1 MP2K1_HUMAN PRKMK1 | VHL-MAP2K1/MAP2K2
Type:
Other Protein Type
Mol. Mass.:
43439.03
Organism:
Homo sapiens (Human)
Description:
Full-length human MEK-1 was generated by PCR and purified as a fusion protein from Escherichia coli lysates.
Residue:
393
  
Inhibitor
Name:
BDBM50099963
Synonyms:
CHEMBL30432 | N*4*-(1-Benzyl-1H-indazol-5-yl)-N*6*,N*6*-dimethyl-pyrido[3,4-d]pyrimidine-4,6-diamine
Type:
Small organic molecule
Emp. Form.:
C23H21N7
Mol. Mass.:
395.4597
SMILES:
CN(C)c1cc2c(Nc3ccc4n(Cc5ccccc5)ncc4c3)ncnc2cn1
: