Target
Receptor tyrosine-protein kinase erbB-2
Ligand
BDBM50099961
Substrate
Meas. Tech.
ChEMBL_194950 (CHEMBL795906)
IC50
290±n/a nM
Citation
 Cockerill, SStubberfield, CStables, JCarter, MGuntrip, SSmith, KMcKeown, SShaw, RTopley, PThomsen, LAffleck, KJowett, AHayes, DWillson, MWoollard, PSpalding, D Indazolylamino quinazolines and pyridopyrimidines as inhibitors of the EGFr and C-erbB-2. Bioorg Med Chem Lett 11:1401-5 (2001)  
Target
Name:
Receptor tyrosine-protein kinase erbB-2
Synonyms:
ERBB2_RAT Neu | Receptor protein-tyrosine kinase erbB-2
Type:
PROTEIN
Mol. Mass.:
138816.81
Organism:
Rattus norvegicus
Description:
ChEMBL_42235
Residue:
1257
  
Inhibitor
Name:
BDBM50099961
Synonyms:
(2-Benzyl-2H-indazol-5-yl)-(6,7-dimethoxy-quinazolin-4-yl)-amine | CHEMBL31161
Type:
Small organic molecule
Emp. Form.:
C24H21N5O2
Mol. Mass.:
411.4558
SMILES:
COc1cc2ncnc(Nc3ccc4nn(Cc5ccccc5)cc4c3)c2cc1OC
: