Target
Cyclin-dependent kinase 1
Ligand
BDBM50099963
Substrate
Meas. Tech.
ChEBML_50330
IC50
>8000±n/a nM
Citation
 Cockerill, SStubberfield, CStables, JCarter, MGuntrip, SSmith, KMcKeown, SShaw, RTopley, PThomsen, LAffleck, KJowett, AHayes, DWillson, MWoollard, PSpalding, D Indazolylamino quinazolines and pyridopyrimidines as inhibitors of the EGFr and C-erbB-2. Bioorg Med Chem Lett 11:1401-5 (2001)  
Target
Name:
Cyclin-dependent kinase 1
Synonyms:
CDC2 CDK1 CDKN1 Cell division protein kinase 1 P34CDC2 | p34 protein kinase
Type:
Enzyme Subunit
Mol. Mass.:
34101.08
Organism:
Homo sapiens (Human)
Description:
P06493
Residue:
297
  
Inhibitor
Name:
BDBM50099963
Synonyms:
CHEMBL30432 | N*4*-(1-Benzyl-1H-indazol-5-yl)-N*6*,N*6*-dimethyl-pyrido[3,4-d]pyrimidine-4,6-diamine
Type:
Small organic molecule
Emp. Form.:
C23H21N7
Mol. Mass.:
395.4597
SMILES:
CN(C)c1cc2c(Nc3ccc4n(Cc5ccccc5)ncc4c3)ncnc2cn1
: