Target
Receptor tyrosine-protein kinase erbB-2
Ligand
BDBM50099964
Substrate
Meas. Tech.
ChEMBL_194950 (CHEMBL795906)
IC50
6600±n/a nM
Citation
 Cockerill, SStubberfield, CStables, JCarter, MGuntrip, SSmith, KMcKeown, SShaw, RTopley, PThomsen, LAffleck, KJowett, AHayes, DWillson, MWoollard, PSpalding, D Indazolylamino quinazolines and pyridopyrimidines as inhibitors of the EGFr and C-erbB-2. Bioorg Med Chem Lett 11:1401-5 (2001)  
Target
Name:
Receptor tyrosine-protein kinase erbB-2
Synonyms:
ERBB2_RAT Neu | Receptor protein-tyrosine kinase erbB-2
Type:
PROTEIN
Mol. Mass.:
138816.81
Organism:
Rattus norvegicus
Description:
ChEMBL_42235
Residue:
1257
  
Inhibitor
Name:
BDBM50099964
Synonyms:
(1-Benzyl-1H-benzoimidazol-5-yl)-quinazolin-4-yl-amine | CHEMBL31615
Type:
Small organic molecule
Emp. Form.:
C22H17N5
Mol. Mass.:
351.4039
SMILES:
C(c1ccccc1)n1cnc2cc(Nc3ncnc4ccccc34)ccc12
: