Target
Geranylgeranyl transferase type-1 subunit beta/Protein farnesyltransferase/geranylgeranyltransferase type-1 subunit alpha
Ligand
BDBM50100004
Substrate
Meas. Tech.
ChEMBL_71953 (CHEMBL685884)
IC50
1300±n/a nM
Citation
 Bergman, JMAbrams, MTDavide, JPGreenberg, IBRobinson, RGBuser, CAHuber, HEKoblan, KSKohl, NELobell, RBGraham, SLHartman, GDWilliams, TMDinsmore, CJ Aryloxy substituted N-arylpiperazinones as dual inhibitors of farnesyltransferase and geranylgeranyltransferase-I. Bioorg Med Chem Lett 11:1411-5 (2001)  
Target
Name:
Geranylgeranyl transferase type-1 subunit beta/Protein farnesyltransferase/geranylgeranyltransferase type-1 subunit alpha
Synonyms:
Geranylgeranyl transferase type I Geranylgeranyl transferase type I beta/Protein farnesyltransferase/geranylgeranyltransferase type I alpha subunit
Type:
Mol. Mass.:
Description:
ASSAY_ID of EBI is 70196
Components:
This complex has 2 components.
Component 1
Name:
Protein farnesyltransferase/geranylgeranyltransferase type-1 subunit alpha
Synonyms:
CAAX farnesyltransferase alpha subunit FNTA_HUMAN FTase-alpha Geranylgeranyl Transferase (GGTase-I) Chain A Protein Farnesyltransferase (PFT) Chain A Protein farnesyltransferase Protein farnesyltransferase/geranylgeranyltransferase type I alpha subunit | Ras proteins prenyltransferase alpha
Type:
Enzyme
Mol. Mass.:
44392.46
Organism:
Homo sapiens (Human)
Description:
Recombinant human FTase.
Residue:
379
  
Component 2
Name:
Geranylgeranyl transferase type-1 subunit beta
Synonyms:
2.5.1.59 Geranylgeranyl transferase type I Geranylgeranyl transferase type I subunit beta PGGT1B Protein farnesyl/geranylgeranyl transferase | Type I protein geranyl-geranyltransferase subunit beta
Type:
Mol. Mass.:
42369.84
Organism:
Homo sapiens (Human)
Description:
Residue:
377
  
Inhibitor
Name:
BDBM50100004
Synonyms:
4-{5-[4-(3-Chloro-phenyl)-3-oxo-piperazin-1-ylmethyl]-imidazol-1-ylmethyl}-2-[3-(2-hydroxy-ethoxy)-phenoxy]-benzonitrile | CHEMBL283203
Type:
Small organic molecule
Emp. Form.:
C30H28ClN5O4
Mol. Mass.:
558.027
SMILES:
OCCOc1cccc(Oc2cc(Cn3cncc3CN3CCN(C(=O)C3)c3cccc(Cl)c3)ccc2C#N)c1
: