Target
Peptide deformylase
Ligand
BDBM50100095
Substrate
Meas. Tech.
ChEMBL_154313 (CHEMBL762798)
IC50
310±n/a nM
Citation
 Apfel, CBanner, DWBur, DDietz, MHubschwerlen, CLocher, HMarlin, FMasciadri, RPirson, WStalder, H 2-(2-Oxo-1,4-dihydro-2H-quinazolin-3-yl)- and 2-(2,2-dioxo-1,4-dihydro-2H-2lambda6-benzo[1,2,6]thiadiazin-3-yl)-N-hydroxy-acetamides as potent and selective peptide deformylase inhibitors. J Med Chem 44:1847-52 (2001)  
Target
Name:
Peptide deformylase
Synonyms:
DEF_ECOLI Peptide Deformylase def | fms
Type:
Enzyme
Mol. Mass.:
19323.16
Organism:
Escherichia coli (strain K12)
Description:
The pdf gene from E. coli K12 was cloned and protein was expressed and purified from E. coli BL21(DE3).
Residue:
169
  
Inhibitor
Name:
BDBM50100095
Synonyms:
2-(5-Chloro-2-oxo-1,4-dihydro-2H-quinazolin-3-yl)-N-hydroxy-acetamide | CHEMBL298647
Type:
Small organic molecule
Emp. Form.:
C10H10ClN3O3
Mol. Mass.:
255.658
SMILES:
ONC(=O)CN1Cc2c(Cl)cccc2NC1=O
: