Target
Geranylgeranyl transferase type-1 subunit beta/Protein farnesyltransferase/geranylgeranyltransferase type-1 subunit alpha
Ligand
BDBM50100282
Substrate
Meas. Tech.
ChEMBL_71952 (CHEMBL685883)
IC50
3100±n/a nM
Citation
 Mactough, SCDesolms, SJShaw, AWAbrams, MTCiccarone, TMDavide, JPHamilton, KAHutchinson, JHKoblan, KSKohl, NELobell, RBRobinson, RGGraham, SL Diaryl ether inhibitors of farnesyl-protein transferase. Bioorg Med Chem Lett 11:1257-60 (2001)  
Target
Name:
Geranylgeranyl transferase type-1 subunit beta/Protein farnesyltransferase/geranylgeranyltransferase type-1 subunit alpha
Synonyms:
Geranylgeranyl transferase type I Geranylgeranyl transferase type I beta/Protein farnesyltransferase/geranylgeranyltransferase type I alpha subunit
Type:
Mol. Mass.:
Description:
ASSAY_ID of EBI is 70196
Components:
This complex has 2 components.
Component 1
Name:
Protein farnesyltransferase/geranylgeranyltransferase type-1 subunit alpha
Synonyms:
CAAX farnesyltransferase alpha subunit FNTA_HUMAN FTase-alpha Geranylgeranyl Transferase (GGTase-I) Chain A Protein Farnesyltransferase (PFT) Chain A Protein farnesyltransferase Protein farnesyltransferase/geranylgeranyltransferase type I alpha subunit | Ras proteins prenyltransferase alpha
Type:
Enzyme
Mol. Mass.:
44392.46
Organism:
Homo sapiens (Human)
Description:
Recombinant human FTase.
Residue:
379
  
Component 2
Name:
Geranylgeranyl transferase type-1 subunit beta
Synonyms:
2.5.1.59 Geranylgeranyl transferase type I Geranylgeranyl transferase type I subunit beta PGGT1B Protein farnesyl/geranylgeranyl transferase | Type I protein geranyl-geranyltransferase subunit beta
Type:
Mol. Mass.:
42369.84
Organism:
Homo sapiens (Human)
Description:
Residue:
377
  
Inhibitor
Name:
BDBM50100282
Synonyms:
4-Imidazol-1-ylmethyl-2-(3-phenyl-propoxy)-benzonitrile | CHEMBL22568
Type:
Small organic molecule
Emp. Form.:
C20H19N3O
Mol. Mass.:
317.3844
SMILES:
N#Cc1ccc(Cn2ccnc2)cc1OCCCc1ccccc1
: