Target
Adenosine kinase
Ligand
BDBM14486
Substrate
Meas. Tech.
ChEMBL_31125 (CHEMBL643553)
IC50
1.6±n/a nM
Citation
 Lee, CHJiang, MCowart, MGfesser, GPerner, RKim, KHGu, YGWilliams, MJarvis, MFKowaluk, EAStewart, AOBhagwat, SS Discovery of 4-amino-5-(3-bromophenyl)-7-(6-morpholino-pyridin-3-yl)pyrido[2,3-d]pyrimidine, an orally active, non-nucleoside adenosine kinase inhibitor.. J Med Chem 44:2133-8 (2001)  
Target
Name:
Adenosine kinase
Synonyms:
ADENOSINE Adenosine 5-phosphotransferase Adenosine kinase | Adk
Type:
Enzyme
Mol. Mass.:
40130.14
Organism:
Rattus norvegicus (rat)
Description:
Rat brain cytosol as enzyme source.
Residue:
361
  
Inhibitor
Name:
BDBM14486
Synonyms:
(2R,3R,4S,5R)-2-(2-amino-9-iodo-3,5,7-triazabicyclo[4.3.0]nona-1,3,5,8-tetraen-7-yl)-5-methyl-oxolane-3,4-diol 5-IT 7-(5-deoxy-beta-D-ribofuranosyl)-5-iodo-7H-pyrrolo[2,3-d]pyrimidin-4-amine | CHEMBL66280
Type:
Small organic molecule
Emp. Form.:
C11H13IN4O3
Mol. Mass.:
376.1504
SMILES:
C[C@H]1O[C@H]([C@H](O)[C@@H]1O)n1cc(I)c2c(N)ncnc12
: