Target
Collagenase ColA
Ligand
BDBM50100784
Substrate
Meas. Tech.
ChEMBL_49485 (CHEMBL659907)
Ki
17±n/a nM
Citation
 Clare, BWScozzafava, ASupuran, CT Protease inhibitors: synthesis of a series of bacterial collagenase inhibitors of the sulfonyl amino acyl hydroxamate type. J Med Chem 44:2253-8 (2001)  
Target
Name:
Collagenase ColA
Synonyms:
120 kDa collagenase Microbial collagenase | colA
Type:
PROTEIN
Mol. Mass.:
125901.02
Organism:
Clostridium perfringens
Description:
ChEMBL_49485
Residue:
1104
  
Inhibitor
Name:
BDBM50100784
Synonyms:
2-[3-(3-Chloro-phenyl)-1-(2-nitro-benzyl)-ureido]-N-hydroxy-propionamide | CHEMBL306717
Type:
Small organic molecule
Emp. Form.:
C17H17ClN4O5
Mol. Mass.:
392.794
SMILES:
CC(N(Cc1ccccc1[N+]([O-])=O)C(=O)Nc1cccc(Cl)c1)C(=O)NO
: