Target
Collagenase ColA
Ligand
BDBM50100805
Substrate
Meas. Tech.
ChEMBL_49485 (CHEMBL659907)
Ki
8±n/a nM
Citation
 Clare, BWScozzafava, ASupuran, CT Protease inhibitors: synthesis of a series of bacterial collagenase inhibitors of the sulfonyl amino acyl hydroxamate type. J Med Chem 44:2253-8 (2001)  
Target
Name:
Collagenase ColA
Synonyms:
120 kDa collagenase Microbial collagenase | colA
Type:
PROTEIN
Mol. Mass.:
125901.02
Organism:
Clostridium perfringens
Description:
ChEMBL_49485
Residue:
1104
  
Inhibitor
Name:
BDBM50100805
Synonyms:
CHEMBL73778 | {3-[(1-Hydroxycarbamoyl-ethyl)-(2-nitro-benzyl)-sulfamoyl]-phenyl}-carbamic acid tert-butyl ester
Type:
Small organic molecule
Emp. Form.:
C21H26N4O8S
Mol. Mass.:
494.518
SMILES:
CC(N(Cc1ccccc1[N+]([O-])=O)S(=O)(=O)c1cccc(NC(=O)OC(C)(C)C)c1)C(=O)NO
: