Target
Collagenase ColA
Ligand
BDBM50100834
Substrate
Meas. Tech.
ChEMBL_49485 (CHEMBL659907)
Ki
10±n/a nM
Citation
 Clare, BWScozzafava, ASupuran, CT Protease inhibitors: synthesis of a series of bacterial collagenase inhibitors of the sulfonyl amino acyl hydroxamate type. J Med Chem 44:2253-8 (2001)  
Target
Name:
Collagenase ColA
Synonyms:
120 kDa collagenase Microbial collagenase | colA
Type:
PROTEIN
Mol. Mass.:
125901.02
Organism:
Clostridium perfringens
Description:
ChEMBL_49485
Residue:
1104
  
Inhibitor
Name:
BDBM50100834
Synonyms:
2-[(3,5-Dichloro-2-hydroxy-benzenesulfonyl)-(2-nitro-benzyl)-amino]-N-hydroxy-propionamide | CHEMBL308852
Type:
Small organic molecule
Emp. Form.:
C16H15Cl2N3O7S
Mol. Mass.:
464.277
SMILES:
CC(N(Cc1ccccc1[N+]([O-])=O)S(=O)(=O)c1cc(Cl)cc(Cl)c1O)C(=O)NO
: