Target
Collagenase ColA
Ligand
BDBM50100847
Substrate
Meas. Tech.
ChEMBL_49485 (CHEMBL659907)
Ki
8±n/a nM
Citation
 Clare, BWScozzafava, ASupuran, CT Protease inhibitors: synthesis of a series of bacterial collagenase inhibitors of the sulfonyl amino acyl hydroxamate type. J Med Chem 44:2253-8 (2001)  
Target
Name:
Collagenase ColA
Synonyms:
120 kDa collagenase Microbial collagenase | colA
Type:
PROTEIN
Mol. Mass.:
125901.02
Organism:
Clostridium perfringens
Description:
ChEMBL_49485
Residue:
1104
  
Inhibitor
Name:
BDBM50100847
Synonyms:
2-[3-Benzoyl-1-(2-nitro-benzyl)-thioureido]-N-hydroxy-propionamide | CHEMBL419445
Type:
Small organic molecule
Emp. Form.:
C18H18N4O5S
Mol. Mass.:
402.424
SMILES:
CC(N(Cc1ccccc1[N+]([O-])=O)C(=S)NC(=O)c1ccccc1)C(=O)NO
: