Target
Stromelysin-1
Ligand
BDBM50100913
Substrate
Meas. Tech.
ChEBML_104731
IC50
36000±n/a nM
Citation
 Michaelides, MRDellaria, JFGong, JHolms, JHBouska, JJStacey, JWada, CKHeyman, HRCurtin, MLGuo, YGoodfellow, CLElmore, IBAlbert, DHMagoc, TJMarcotte, PAMorgan, DWDavidsen, SK Biaryl ether retrohydroxamates as potent, long-lived, orally bioavailable MMP inhibitors. Bioorg Med Chem Lett 11:1553-6 (2001)  
Target
Name:
Stromelysin-1
Synonyms:
MMP-3 MMP3_HUMAN Matrix metalloproteinase 3 Matrix metalloproteinase-3 (MMP-3) SL-1 Stromelysin 1 | Transin-1
Type:
Enzyme
Mol. Mass.:
53973.13
Organism:
Homo sapiens (Human)
Description:
P08254
Residue:
477
  
Inhibitor
Name:
BDBM50100913
Synonyms:
CHEMBL39358 | N-[1-(4'-Cyano-biphenyl-4-yloxymethyl)-2-phenylsulfanyl-ethyl]-N-hydroxy-formamide
Type:
Small organic molecule
Emp. Form.:
C23H20N2O3S
Mol. Mass.:
404.482
SMILES:
ON(C=O)C(COc1ccc(cc1)-c1ccc(cc1)C#N)CSc1ccccc1
: