Target
Gonadotropin-releasing hormone receptor
Ligand
BDBM50101184
Substrate
Meas. Tech.
ChEMBL_71606 (CHEMBL689138)
IC50
0.200000±n/a nM
Citation
 Ashton, WTSisco, RMYang, YTLo, JLYudkovitz, JBCheng, KGoulet, MT Substituted indole-5-carboxamides and -acetamides as potent nonpeptide GnRH receptor antagonists. Bioorg Med Chem Lett 11:1723-6 (2001)  
Target
Name:
Gonadotropin-releasing hormone receptor
Synonyms:
GNRHR_RAT GnRH-R | Gnrhr
Type:
PROTEIN
Mol. Mass.:
37767.60
Organism:
Rattus norvegicus
Description:
ChEMBL_1335047
Residue:
327
  
Inhibitor
Name:
BDBM50101184
Synonyms:
CHEMBL47761 | N-[4-(4-{2-[5-(1,1-Dimethyl-2-oxo-2-pyrrolidin-1-yl-ethyl)-2-(3,5-dimethyl-phenyl)-1H-indol-3-yl]-ethylamino}-butyl)-phenyl]-methanesulfonamide
Type:
Small organic molecule
Emp. Form.:
C37H48N4O3S
Mol. Mass.:
628.867
SMILES:
Cc1cc(C)cc(c1)-c1[nH]c2ccc(cc2c1CCNCCCCc1ccc(NS(C)(=O)=O)cc1)C(C)(C)C(=O)N1CCCC1
: