Target
Carnitine O-palmitoyltransferase 1, liver isoform
Ligand
BDBM50101602
Substrate
Meas. Tech.
ChEMBL_46317 (CHEMBL663461)
IC50
>300000±n/a nM
Citation
 Giannessi, FChiodi, PMarzi, MMinetti, PPessotto, PDe Angelis, FTassoni, EConti, RGiorgi, FMabilia, MDell'Uomo, NMuck, STinti, MOCarminati, PArduini, A Reversible carnitine palmitoyltransferase inhibitors with broad chemical diversity as potential antidiabetic agents. J Med Chem 44:2383-6 (2001)  
Target
Name:
Carnitine O-palmitoyltransferase 1, liver isoform
Synonyms:
CPT I CPT1A_RAT Carnitine O-palmitoyltransferase I, liver isoform Cpt-1 Cpt1a
Type:
PROTEIN
Mol. Mass.:
88147.11
Organism:
Rattus norvegicus
Description:
ChEMBL_887445
Residue:
773
  
Inhibitor
Name:
BDBM50101602
Synonyms:
1-(2-Nonylcarbamoyloxy-3-phosphono-propyl)-pyridinium; chloride | CHEMBL310808
Type:
Small organic molecule
Emp. Form.:
C18H32N2O5P
Mol. Mass.:
387.4303
SMILES:
CCCCCCCCCNC(=O)OC(C[n+]1ccccc1)CP(O)(O)=O
: