Target
Geranylgeranyl transferase type-1 subunit beta/Protein farnesyltransferase/geranylgeranyltransferase type-1 subunit alpha
Ligand
BDBM50101921
Substrate
Meas. Tech.
ChEMBL_71957 (CHEMBL686122)
IC50
1090±n/a nM
Citation
 Beshore, DCBell, IMDinsmore, CJHomnick, CFCulberson, JCRobinson, RGFernandes, CWalsh, ESAbrams, MTBhimnathwala, HGDavide, JPEllis-Hutchings, MSHuber, HAKoblan, KSBuser, CAKohl, NELobell, RBChen, IWMcLoughlin, DAOlah, TVGraham, SLHartman, GDWilliams, TM Evaluation of amino acid-based linkers in potent macrocyclic inhibitors of farnesyl-protein transferase. Bioorg Med Chem Lett 11:1817-21 (2001)  
Target
Name:
Geranylgeranyl transferase type-1 subunit beta/Protein farnesyltransferase/geranylgeranyltransferase type-1 subunit alpha
Synonyms:
Geranylgeranyl transferase type I Geranylgeranyl transferase type I beta/Protein farnesyltransferase/geranylgeranyltransferase type I alpha subunit
Type:
Mol. Mass.:
Description:
ASSAY_ID of EBI is 70196
Components:
This complex has 2 components.
Component 1
Name:
Protein farnesyltransferase/geranylgeranyltransferase type-1 subunit alpha
Synonyms:
CAAX farnesyltransferase alpha subunit FNTA_HUMAN FTase-alpha Geranylgeranyl Transferase (GGTase-I) Chain A Protein Farnesyltransferase (PFT) Chain A Protein farnesyltransferase Protein farnesyltransferase/geranylgeranyltransferase type I alpha subunit | Ras proteins prenyltransferase alpha
Type:
Enzyme
Mol. Mass.:
44392.46
Organism:
Homo sapiens (Human)
Description:
Recombinant human FTase.
Residue:
379
  
Component 2
Name:
Geranylgeranyl transferase type-1 subunit beta
Synonyms:
2.5.1.59 Geranylgeranyl transferase type I Geranylgeranyl transferase type I subunit beta PGGT1B Protein farnesyl/geranylgeranyl transferase | Type I protein geranyl-geranyltransferase subunit beta
Type:
Mol. Mass.:
42369.84
Organism:
Homo sapiens (Human)
Description:
Residue:
377
  
Inhibitor
Name:
BDBM50101921
Synonyms:
19-methyl-15,18-dioxo-2-oxa-9,11,16,19-tetraazapentacyclo[18.6.2.13,7.09,13.024,28]nonacosa-1(27),3,5,7(29),10,12,20(28),21,23,25-decaen-4-yl cyanide | CHEMBL50857
Type:
Small organic molecule
Emp. Form.:
C26H21N5O3
Mol. Mass.:
451.4766
SMILES:
CN1c2cccc3ccc(Oc4cc(Cn5cncc5CC(=O)NCC1=O)ccc4C#N)cc23
: