Target
Protein farnesyltransferase subunit beta/geranylgeranyltransferase type-1 subunit alpha
Ligand
BDBM50101908
Substrate
Meas. Tech.
ChEMBL_70441 (CHEMBL681298)
IC50
67±n/a nM
Citation
 Beshore, DCBell, IMDinsmore, CJHomnick, CFCulberson, JCRobinson, RGFernandes, CWalsh, ESAbrams, MTBhimnathwala, HGDavide, JPEllis-Hutchings, MSHuber, HAKoblan, KSBuser, CAKohl, NELobell, RBChen, IWMcLoughlin, DAOlah, TVGraham, SLHartman, GDWilliams, TM Evaluation of amino acid-based linkers in potent macrocyclic inhibitors of farnesyl-protein transferase. Bioorg Med Chem Lett 11:1817-21 (2001)  
Target
Name:
Protein farnesyltransferase subunit beta/geranylgeranyltransferase type-1 subunit alpha
Synonyms:
Protein Farnesyltransferase (PFT)/farnesyltransferase beta subunit | Protein farnesyltransferase
Type:
Mol. Mass.:
Description:
ASSAY_ID of EBI is 69815
Components:
This complex has 2 components.
Component 1
Name:
Protein farnesyltransferase subunit beta
Synonyms:
CAAX farnesyltransferase subunit beta FTase-beta Protein farnesyltransferase Ras proteins prenyltransferase subunit beta
Type:
PROTEIN
Mol. Mass.:
48666.41
Organism:
Rattus norvegicus
Description:
EBI_10573
Residue:
437
  
Component 2
Name:
Protein farnesyltransferase/geranylgeranyltransferase type-1 subunit alpha
Synonyms:
CAAX farnesyltransferase alpha subunit FTase-alpha GGTase-I-alpha Protein farnesyltransferase/geranylgeranyltransferase type I alpha subunit Type I protein geranyl-geranyltransferase alpha subunit | geranylgeranyltransferase type-I
Type:
Enzyme
Mol. Mass.:
44030.14
Organism:
Rattus norvegicus (rat)
Description:
Recombinant rat enzyme.
Residue:
377
  
Inhibitor
Name:
BDBM50101908
Synonyms:
15,18-dioxo-2-oxa-9,11,16,19-tetraazapentacyclo[18.6.2.13,7.09,13.024,28]nonacosa-1(27),3,5,7(29),10,12,20(28),21,23,25-decaen-4-yl cyanide | CHEMBL53811
Type:
Small organic molecule
Emp. Form.:
C25H19N5O3
Mol. Mass.:
437.4501
SMILES:
O=C1CNC(=O)Cc2cncn2Cc2ccc(C#N)c(Oc3ccc4cccc(N1)c4c3)c2
: