Target
Sodium-dependent serotonin transporter
Ligand
BDBM50102017
Substrate
Meas. Tech.
ChEBML_201982
Ki
3.1±n/a nM
Citation
 Meagher, KLMewshaw, REEvrard, DAZhou, PSmith, DLScerni, RSpangler, TAbulhawa, SShi, XSchechter, LEAndree, TH Studies towards the next generation of antidepressants. Part 1: Indolylcyclohexylamines as potent serotonin reuptake inhibitors. Bioorg Med Chem Lett 11:1885-8 (2001)  
Target
Name:
Sodium-dependent serotonin transporter
Synonyms:
5-HT Transporter 5HT transporter Anandamid membrane transporter, AMT Monoamine transporters; Norepinephrine & serotonin Slc6a4 Sodium-dependent serotonin transporter (SERT) | imipramine receptor
Type:
Multi-pass membrane protein
Mol. Mass.:
70168.43
Organism:
Rattus norvegicus (rat)
Description:
P31652
Residue:
630
  
Inhibitor
Name:
BDBM50102017
Synonyms:
3-(4-Benzylamino-cyclohex-1-enyl)-1H-indole-5-carbonitrile | CHEMBL294398
Type:
Small organic molecule
Emp. Form.:
C22H21N3
Mol. Mass.:
327.4222
SMILES:
N#Cc1ccc2[nH]cc(C3=CCC(CC3)NCc3ccccc3)c2c1
: