Target
Growth factor receptor-bound protein 2
Ligand
BDBM50102025
Substrate
Meas. Tech.
ChEBML_72490
IC50
20±n/a nM
Citation
 Gao, YVoigt, JWu, JXYang, DBurke, TR Macrocyclization in the design of a conformationally constrained Grb2 SH2 domain inhibitor. Bioorg Med Chem Lett 11:1889-92 (2001)  
Target
Name:
Growth factor receptor-bound protein 2
Synonyms:
ASH GRB2 adapter protein Grb2-SH2 | Growth factor receptor-bound protein 2
Type:
Protein
Mol. Mass.:
25205.04
Organism:
Homo sapiens (Human)
Description:
P62993
Residue:
217
  
Inhibitor
Name:
BDBM50102025
Synonyms:
4-[(10S,14S,18S)-18-(2-AMINO-2-OXOETHYL)-14-(1-NAPHTHYLMETHYL)-8,17,20-TRIOXO-7,16,19-TRIAZASPIRO[5.14]ICOS-11-EN-10-YL]BENZYLPHOSPHONIC ACID [(R)-4-((E)-(S)-18-Carbamoylmethyl-14-naphthalen-1-ylmethyl-8,20-dioxo-17-(S)-oxo-7,16,19-triaza-spiro[5.14]icos-11-en-10-yl)-benzyl]-phosphonic acid [4-(18-Carbamoylmethyl-14-naphthalen-1-ylmethyl-8,17,20-trioxo-7,16,19-triaza-spiro[5.14]icos-11-en-10-yl)-benzyl]-phosphonic acid
Type:
Small organic molecule
Emp. Form.:
C37H45N4O7P
Mol. Mass.:
688.7496
SMILES:
NC(=O)C[C@@H]1NC(=O)C2(CCCCC2)NC(=O)C[C@H](\C=C\C[C@@H](Cc2cccc3ccccc23)CNC1=O)c1ccc(CP(O)(O)=O)cc1
: