Target
Type-1 angiotensin II receptor
Ligand
BDBM50544735
Substrate
Meas. Tech.
ChEMBL_1993677 (CHEMBL4627572)
EC50
>10000±n/a nM
Citation
 Narayanan, SVasukuttan, VRajagopal, SMaitra, RRunyon, SP Identification of potent pyrazole based APELIN receptor (APJ) agonists. Bioorg Med Chem 28:0 (2020)  
Target
Name:
Type-1 angiotensin II receptor
Synonyms:
AGTR1 AGTR1B AT1 AT1BR AT2R1B Angiotensin II receptor Type-1 angiotensin II receptor (AT1)
Type:
Protein
Mol. Mass.:
41080.75
Organism:
Homo sapiens (Human)
Description:
P30556
Residue:
359
  
Inhibitor
Name:
BDBM50544735
Synonyms:
CHEMBL4640815
Type:
Small organic molecule
Emp. Form.:
C31H48N4O5
Mol. Mass.:
556.7366
SMILES:
CC[C@@H](O)CNC(=O)C[C@H](CCC1CCCCC1)NC(=O)c1cc(-c2c(OC)cccc2OC)n(CC(C)C)n1
: