Target
Type-1 angiotensin II receptor
Ligand
BDBM50544729
Substrate
Meas. Tech.
ChEMBL_1993677 (CHEMBL4627572)
EC50
>10000±n/a nM
Citation
 Narayanan, SVasukuttan, VRajagopal, SMaitra, RRunyon, SP Identification of potent pyrazole based APELIN receptor (APJ) agonists. Bioorg Med Chem 28:0 (2020)  
Target
Name:
Type-1 angiotensin II receptor
Synonyms:
AGTR1 AGTR1B AT1 AT1BR AT2R1B Angiotensin II receptor Type-1 angiotensin II receptor (AT1)
Type:
Protein
Mol. Mass.:
41080.75
Organism:
Homo sapiens (Human)
Description:
P30556
Residue:
359
  
Inhibitor
Name:
BDBM50544729
Synonyms:
CHEMBL4647391
Type:
Small organic molecule
Emp. Form.:
C33H48N4O4
Mol. Mass.:
564.7586
SMILES:
COc1cccc(OC)c1-c1cc(nn1C1CCCCC1)C(=O)N[C@@H](CCC1CCCCC1)CC(=O)NC1CCC1
: