Target
Sulfotransferase 1E1
Ligand
BDBM50102708
Substrate
Meas. Tech.
ChEMBL_67847 (CHEMBL681339)
IC50
60000±n/a nM
Citation
 Verdugo, DECancilla, MTGe, XGray, NSChang, YTSchultz, PGNegishi, MLeary, JABertozzi, CR Discovery of estrogen sulfotransferase inhibitors from a purine library screen. J Med Chem 44:2683-6 (2001)  
Target
Name:
Sulfotransferase 1E1
Synonyms:
Est ST1E1_MOUSE Sult1e1
Type:
PROTEIN
Mol. Mass.:
35591.32
Organism:
Mus musculus
Description:
ChEMBL_67847
Residue:
295
  
Inhibitor
Name:
BDBM50102708
Synonyms:
2-[6-(3,5-Dichloro-benzylamino)-9-methyl-9H-purin-2-ylamino]-acetamide(YTB6) | CHEMBL93782
Type:
Small organic molecule
Emp. Form.:
C15H15Cl2N7O
Mol. Mass.:
380.232
SMILES:
Cn1cnc2c(NCc3cc(Cl)cc(Cl)c3)nc(NCC(N)=O)nc12
: