Target
Proteinase-activated receptor 1
Ligand
BDBM50103024
Substrate
Meas. Tech.
ChEBML_90174
IC50
1000±n/a nM
Citation
 Zhang, HCMcComsey, DFWhite, KBAddo, MFAndrade-Gordon, PDerian, CKOksenberg, DMaryanoff, BE Thrombin receptor (PAR-1) antagonists. Solid-phase synthesis of indole-based peptide mimetics by anchoring to a secondary amide. Bioorg Med Chem Lett 11:2105-9 (2001)  
Target
Name:
Proteinase-activated receptor 1
Synonyms:
CF2R F2R PAR1 Proteinase activated receptor 1 TR Thrombin receptor/ Proteinase-activated receptor 1(Par-1)
Type:
Protein
Mol. Mass.:
47450.07
Organism:
Homo sapiens (Human)
Description:
P25116
Residue:
425
  
Inhibitor
Name:
BDBM50103024
Synonyms:
(S)-5-Guanidino-2-((S)-3-(4-methoxy-phenyl)-2-{3-[1-(2-methyl-benzyl)-3-pyrrolidin-1-ylmethyl-1H-indol-6-yl]-ureido}-propionylamino)-pentanoic acid (3-phenyl-propyl)-amide | CHEMBL62775
Type:
Small organic molecule
Emp. Form.:
C47H59N9O4
Mol. Mass.:
814.0293
SMILES:
COc1ccc(C[C@H](NC(=O)Nc2ccc3c(CN4CCCC4)cn(Cc4ccccc4C)c3c2)C(=O)N[C@@H](CCCNC(N)=N)C(=O)NCCCc2ccccc2)cc1
: