Target
Proto-oncogene tyrosine-protein kinase Src
Ligand
BDBM50103045
Substrate
Meas. Tech.
ChEBML_202785
IC50
130±n/a nM
Citation
 Lesuisse, DDeprez, PAlbert, EDuc, TTSortais, BGofflo, DJean-Baptiste, VMarquette, JSchoot, BSarubbi, ELange, GBroto, PMandine, E Discovery of thioazepinone ligands for Src SH2: from non-specific to specific binding. Bioorg Med Chem Lett 11:2127-31 (2001)  
Target
Name:
Proto-oncogene tyrosine-protein kinase Src
Synonyms:
Calmodulin/Proto-oncogene tyrosine-protein kinase Src Proto-oncogene c-Src SRC SRC_HUMAN V-src sarcoma (Schmidt-Ruppin A-2) viral oncogene homolog (avian) p60-Src | pp60c-src
Type:
Protein
Mol. Mass.:
59838.60
Organism:
Homo sapiens (Human)
Description:
P12931
Residue:
536
  
Inhibitor
Name:
BDBM50103045
Synonyms:
3-{(R)-6-[(S)-2-Acetylamino-3-(4-phosphonooxy-phenyl)-propionylamino]-5-oxo-[1,4]thiazepan-4-ylmethyl}-benzoic acid methyl ester | CHEMBL410119
Type:
Small organic molecule
Emp. Form.:
C25H30N3O9PS
Mol. Mass.:
579.559
SMILES:
COC(=O)c1cccc(CN2CCSC[C@H](NC(=O)[C@H](Cc3ccc(OP(O)(O)=O)cc3)NC(C)=O)C2=O)c1
: