Target
5-hydroxytryptamine receptor 3A
Ligand
BDBM50103074
Substrate
Meas. Tech.
ChEBML_3480
EC50
240±n/a nM
Citation
 Parihar, HSSuryanarayanan, AMa, CJoshi, PVenkataraman, PSchulte, MKKirschbaum, KS 5-HT(3)R binding of lerisetron: an interdisciplinary approach to drug-Receptor interactions. Bioorg Med Chem Lett 11:2133-6 (2001)  
Target
Name:
5-hydroxytryptamine receptor 3A
Synonyms:
5-HT-3 5-HT3A 5-hydroxytryptamine receptor 3 (5-HT3) 5-hydroxytryptamine receptor 3A (5HT3A) 5HT3R HTR3A Serotonin 3 receptor (5HT3) Serotonin-gated ion channel receptor | Serotonin-gated ion channel receptor 3
Type:
Protein
Mol. Mass.:
55283.27
Organism:
Homo sapiens (Human)
Description:
P46098
Residue:
478
  
Inhibitor
Name:
BDBM50103074
Synonyms:
1-Allyl-2-piperazin-1-yl-1H-benzoimidazole | CHEMBL68281
Type:
Small organic molecule
Emp. Form.:
C14H18N4
Mol. Mass.:
242.3195
SMILES:
C=CCn1c(nc2ccccc12)N1CCNCC1
: