Target
Disintegrin and metalloproteinase domain-containing protein 17
Ligand
BDBM50103102
Substrate
Meas. Tech.
ChEBML_207455
Ki
27±n/a nM
Citation
 Musso, DLAndersen, MWAndrews, RCAustin, RBeaudet, EJBecherer, JDBubacz, DGBickett, DMChan, JHConway, JGCowan, DJGaul, MDGlennon, KCHedeen, KMLambert, MHLeesnitzer, MAMcDougald, DLMitchell, JLMoss, MLRabinowitz, MHRizzolio, MCSchaller, LTStanford, JBTippin, TWarner, JRWhitesell, LGWiethe, RW N-hydroxyformamide peptidomimetics as TACE/matrix metalloprotease inhibitors: oral activity via P1' isobutyl substitution. Bioorg Med Chem Lett 11:2147-51 (2001)  
Target
Name:
Disintegrin and metalloproteinase domain-containing protein 17
Synonyms:
ADA17_HUMAN CSVP Disintegrin and metalloproteinase domain-containing protein 17 (ADAM17) TNF-alpha convertase TNF-alpha-converting enzyme (TACE) Tumor necrosis factor-α converting enzyme (TACE)
Type:
Enzyme
Mol. Mass.:
93007.89
Organism:
Homo sapiens (Human)
Description:
Residue:
824
  
Inhibitor
Name:
BDBM50103102
Synonyms:
(R)-2-[(S)-1-(Formyl-hydroxy-amino)-ethyl]-4-methyl-pentanoic acid [2-methyl-1-(thiazol-2-ylcarbamoyl)-propyl]-amide | CHEMBL302941
Type:
Small organic molecule
Emp. Form.:
C17H28N4O4S
Mol. Mass.:
384.494
SMILES:
CC(C)C[C@H]([C@H](C)N(O)C=O)C(=O)N[C@@H](C(C)C)C(=O)Nc1nccs1
: