Target
Tyrosine-protein phosphatase non-receptor type 1
Ligand
BDBM50103234
Substrate
Meas. Tech.
ChEMBL_162609 (CHEMBL771321)
Ki
900000±n/a nM
Citation
 Gao, YVoigt, JZhao, HPais, GCZhang, XWu, LZhang, ZYBurke, TR Utilization of a peptide lead for the discovery of a novel PTP1B-binding motif. J Med Chem 44:2869-78 (2001)  
Target
Name:
Tyrosine-protein phosphatase non-receptor type 1
Synonyms:
PTN1_HUMAN PTPN1 Protein tyrosine phosphatase-1B (PTP1B) Protein-tyrosine phosphatase 1B (PTP1B) Tyrosine-protein phosphatase non-receptor type 1 (PTP1B)
Type:
Protein phosphatase
Mol. Mass.:
49963.76
Organism:
Homo sapiens (Human)
Description:
Human recombinant GST-fusion PTP1B (1-435).
Residue:
435
  
Inhibitor
Name:
BDBM50103234
Synonyms:
2-Carboxymethoxy-naphthalene-1,6-dicarboxylic acid | CHEMBL96035
Type:
Small organic molecule
Emp. Form.:
C14H10O7
Mol. Mass.:
290.225
SMILES:
OC(=O)COc1ccc2cc(ccc2c1C(O)=O)C(O)=O
: