Target
Geranylgeranyl transferase type-1 subunit beta
Ligand
BDBM50103323
Substrate
Meas. Tech.
ChEMBL_72108 (CHEMBL683552)
IC50
6500±n/a nM
Citation
 Bell, IMGallicchio, SNAbrams, MBeshore, DCBuser, CACulberson, JCDavide, JEllis-Hutchings, MFernandes, CGibbs, JBGraham, SLHartman, GDHeimbrook, DCHomnick, CFHuff, JRKassahun, KKoblan, KSKohl, NELobell, RBLynch, JJMiller, PAOmer, CARodrigues, ADWalsh, ESWilliams, TM Design and biological activity of (S)-4-(5-([1-(3-chlorobenzyl)-2-oxopyrrolidin-3-ylamino]methyl)imidazol-1-ylmethyl)benzonitrile, a 3-aminopyrrolidinone farnesyltransferase inhibitor with excellent cell potency. J Med Chem 44:2933-49 (2001)  
Target
Name:
Geranylgeranyl transferase type-1 subunit beta
Synonyms:
2.5.1.59 Geranylgeranyl transferase type I Geranylgeranyl transferase type I subunit beta PGGT1B Protein farnesyl/geranylgeranyl transferase | Type I protein geranyl-geranyltransferase subunit beta
Type:
Mol. Mass.:
42369.84
Organism:
Homo sapiens (Human)
Description:
Residue:
377
  
Inhibitor
Name:
BDBM50103323
Synonyms:
4-(5-{[1-(3-Chloro-phenyl)-2-oxo-pyrrolidin-3-ylamino]-methyl}-imidazol-1-ylmethyl)-benzonitrile | CHEMBL99205
Type:
Small organic molecule
Emp. Form.:
C22H20ClN5O
Mol. Mass.:
405.88
SMILES:
Clc1cccc(c1)N1CC[C@H](NCc2cncn2Cc2ccc(cc2)C#N)C1=O
: