Target
Geranylgeranyl transferase type-1 subunit beta
Ligand
BDBM50103337
Substrate
Meas. Tech.
ChEMBL_72108 (CHEMBL683552)
IC50
11000±n/a nM
Citation
 Bell, IMGallicchio, SNAbrams, MBeshore, DCBuser, CACulberson, JCDavide, JEllis-Hutchings, MFernandes, CGibbs, JBGraham, SLHartman, GDHeimbrook, DCHomnick, CFHuff, JRKassahun, KKoblan, KSKohl, NELobell, RBLynch, JJMiller, PAOmer, CARodrigues, ADWalsh, ESWilliams, TM Design and biological activity of (S)-4-(5-([1-(3-chlorobenzyl)-2-oxopyrrolidin-3-ylamino]methyl)imidazol-1-ylmethyl)benzonitrile, a 3-aminopyrrolidinone farnesyltransferase inhibitor with excellent cell potency. J Med Chem 44:2933-49 (2001)  
Target
Name:
Geranylgeranyl transferase type-1 subunit beta
Synonyms:
2.5.1.59 Geranylgeranyl transferase type I Geranylgeranyl transferase type I subunit beta PGGT1B Protein farnesyl/geranylgeranyl transferase | Type I protein geranyl-geranyltransferase subunit beta
Type:
Mol. Mass.:
42369.84
Organism:
Homo sapiens (Human)
Description:
Residue:
377
  
Inhibitor
Name:
BDBM50103337
Synonyms:
(S)-4-((5-((1-(3-chlorobenzoyl)pyrrolidin-3-ylamino)methyl)-1H-imidazol-1-yl)methyl)benzonitrile CHEMBL317520
Type:
Small organic molecule
Emp. Form.:
C23H22ClN5O
Mol. Mass.:
419.907
SMILES:
Clc1cccc(c1)C(=O)N1CC[C@@H](C1)NCc1cncn1Cc1ccc(cc1)C#N
: