Target
Dimer of Protein farnesyltransferase subunit beta
Ligand
BDBM50103352
Substrate
Meas. Tech.
ChEMBL_69996 (CHEMBL681469)
IC50
9.5±n/a nM
Citation
 Bell, IMGallicchio, SNAbrams, MBeshore, DCBuser, CACulberson, JCDavide, JEllis-Hutchings, MFernandes, CGibbs, JBGraham, SLHartman, GDHeimbrook, DCHomnick, CFHuff, JRKassahun, KKoblan, KSKohl, NELobell, RBLynch, JJMiller, PAOmer, CARodrigues, ADWalsh, ESWilliams, TM Design and biological activity of (S)-4-(5-([1-(3-chlorobenzyl)-2-oxopyrrolidin-3-ylamino]methyl)imidazol-1-ylmethyl)benzonitrile, a 3-aminopyrrolidinone farnesyltransferase inhibitor with excellent cell potency. J Med Chem 44:2933-49 (2001)  
Target
Name:
Dimer of Protein farnesyltransferase subunit beta
Synonyms:
Protein Farnesyltransferase (PFT) Chain B
Type:
Mol. Mass.:
Description:
ASSAY_ID of EBI is 51428
Components:
This complex has 3 components.
Component 1
Name:
Protein farnesyltransferase subunit beta
Synonyms:
CAAX farnesyltransferase subunit alpha FNTB FTase-alpha GGTase-I-alpha Protein farnesyl/geranylgeranyl transferase Protein farnesyltransferase subunit beta Protein farnesyltransferase/geranylgeranyltransferase type-1 subunit alpha Ras proteins prenyltransferase subunit beta | Type I protein geranyl-geranyltransferase subunit alpha
Type:
Enzyme Subunit
Mol. Mass.:
48766.02
Organism:
Homo sapiens (Human)
Description:
Protein farnesyltransferase subunit beta
Residue:
437
  
Component 2
Name:
Protein farnesyltransferase subunit beta
Synonyms:
CAAX farnesyltransferase subunit alpha FNTB FTase-alpha GGTase-I-alpha Protein farnesyl/geranylgeranyl transferase Protein farnesyltransferase subunit beta Protein farnesyltransferase/geranylgeranyltransferase type-1 subunit alpha Ras proteins prenyltransferase subunit beta | Type I protein geranyl-geranyltransferase subunit alpha
Type:
Enzyme Subunit
Mol. Mass.:
48766.02
Organism:
Homo sapiens (Human)
Description:
Protein farnesyltransferase subunit beta
Residue:
437
  
Inhibitor
Name:
BDBM50103352
Synonyms:
(S)-4-((5-((2-oxo-1-(quinolin-5-yl)pyrrolidin-3-ylamino)methyl)-1H-imidazol-1-yl)methyl)benzonitrile CHEMBL100566
Type:
Small organic molecule
Emp. Form.:
C25H22N6O
Mol. Mass.:
422.4818
SMILES:
O=C1[C@H](CCN1c1cccc2ncccc12)NCc1cncn1Cc1ccc(cc1)C#N
: