Target
Coagulation factor X
Ligand
BDBM50103664
Substrate
Meas. Tech.
ChEBML_48973
IC50
14±n/a nM
Citation
 Su, TWu, YDoughan, BKane-Maguire, KMarlowe, CKKanter, JPWoolfrey, JHuang, BWong, PSinha, UPark, GMalinowski, JHollenbach, SScarborough, RMZhu, BY Design and synthesis of glycolic and mandelic acid derivatives as factor Xa inhibitors. Bioorg Med Chem Lett 11:2279-82 (2001)  
Target
Name:
Coagulation factor X
Synonyms:
Activated coagulation factor X (FXa) Coagulation factor X precursor F10 Factor X heavy chain Factor Xa Stuart-Prower factor
Type:
Enzyme
Mol. Mass.:
54726.60
Organism:
Homo sapiens (Human)
Description:
Residue:
488
  
Inhibitor
Name:
BDBM50103664
Synonyms:
2-(3-Carbamimidoyl-phenoxy)-N-[4-(4,5-dichloro-imidazol-1-yl)-phenyl]-2-phenyl-acetamide | CHEMBL311612
Type:
Small organic molecule
Emp. Form.:
C24H19Cl2N5O2
Mol. Mass.:
480.346
SMILES:
NC(=N)c1cccc(OC(C(=O)Nc2ccc(cc2)-n2cnc(Cl)c2Cl)c2ccccc2)c1
: