Target
Tryptase beta-2
Ligand
BDBM50093142
Substrate
Meas. Tech.
ChEBML_210702
Ki
0.070000±n/a nM
Citation
 Dener, JMWang, VRRice, KDGangloff, ARKuo, EYNewcomb, WSPutnam, DWong, M Monocharged inhibitors of mast cell tryptase derived from potent and selective dibasic inhibitors. Bioorg Med Chem Lett 11:2325-30 (2001)  
Target
Name:
Tryptase beta-2
Synonyms:
TPS2 TRYB2_HUMAN Tryptase II Tryptase-2
Type:
PROTEIN
Mol. Mass.:
30518.79
Organism:
Homo sapiens (Human)
Description:
ChEMBL_210702
Residue:
275
  
Inhibitor
Name:
BDBM50093142
Synonyms:
1,5-di{4-[4-amino(imino)methylaminobenzylcarbamoyl]hexahydro-1-pyrazinylcarbonyloxy}cyclooctane APC-1390 Derivative of piperazine-1-carboxylic acid 5-(piperazine-1-carbonyloxy)-cyclooctyl ester
Type:
Small organic molecule
Emp. Form.:
C36H52N12O6
Mol. Mass.:
748.8749
SMILES:
[#7]\[#6](-[#7])=[#7]/c1ccc(-[#6]-[#7]-[#6](=O)-[#7]-2-[#6]-[#6]-[#7](-[#6]-[#6]-2)-[#6](=O)-[#8]-[#6@H]-2-[#6]-[#6]-[#6]-[#6@H](-[#6]-[#6]-[#6]-2)-[#8]-[#6](=O)-[#7]-2-[#6]-[#6]-[#7](-[#6]-[#6]-2)-[#6](=O)-[#7]-[#6]-c2ccc(cc2)\[#7]=[#6](/[#7])-[#7])cc1
: