Target
Interstitial collagenase
Ligand
BDBM50104006
Substrate
Meas. Tech.
ChEMBL_105958 (CHEMBL715371)
IC50
104±n/a nM
Citation
 Hanessian, SMacKay, DBMoitessier, N Design and synthesis of matrix metalloproteinase inhibitors guided by molecular modeling. Picking the S(1) pocket using conformationally constrained inhibitors. J Med Chem 44:3074-82 (2001)  
Target
Name:
Interstitial collagenase
Synonyms:
CLG MMP1 Matrix metalloproteinase-1 | Matrix metalloproteinase-1 (MMP-1)
Type:
Enzyme
Mol. Mass.:
54010.26
Organism:
Homo sapiens (Human)
Description:
P03956
Residue:
469
  
Inhibitor
Name:
BDBM50104006
Synonyms:
4-Benzylsulfanyl-N-hydroxy-2-[isobutyl-(4-methoxy-benzenesulfonyl)-amino]-butyramide | CHEMBL320402
Type:
Small organic molecule
Emp. Form.:
C22H30N2O5S2
Mol. Mass.:
466.614
SMILES:
COc1ccc(cc1)S(=O)(=O)N(CC(C)C)[C@H](CCSCc1ccccc1)C(=O)NO
: