Target
P2Y purinoceptor 1
Ligand
BDBM50104016
Substrate
Meas. Tech.
ChEMBL_147893 (CHEMBL759293)
IC50
1740±n/a nM
Citation
 Kim, HSBarak, DHarden, TKBoyer, JLJacobson, KA Acyclic and cyclopropyl analogues of adenosine bisphosphate antagonists of the P2Y1 receptor: structure-activity relationships and receptor docking. J Med Chem 44:3092-108 (2001)  
Target
Name:
P2Y purinoceptor 1
Synonyms:
P2RY1 | P2RY1_MELGA
Type:
Mol. Mass.:
41199.64
Organism:
Meleagris gallopavo
Description:
Residue:
362
  
Inhibitor
Name:
BDBM50104016
Synonyms:
CHEMBL106860 | Phosphoric acid mono-[2-(2-chloro-6-methylamino-purin-9-ylmethyl)-3-phosphonooxymethyl-cyclopropylmethyl] ester
Type:
Small organic molecule
Emp. Form.:
C12H18ClN5O8P2
Mol. Mass.:
457.701
SMILES:
CNc1nc(Cl)nc2n(C[C@@H]3[C@@H](COP(O)(O)=O)[C@H]3COP(O)(O)=O)cnc12
: