Target
Chymotrypsinogen A
Ligand
BDBM50104174
Substrate
Meas. Tech.
ChEBML_216785
Ki
480±n/a nM
Citation
 Harvey, AJAbell, AD Alpha-ketoester-based photobiological switches: synthesis, peptide chain extension and assay against alpha-chymotrypsin. Bioorg Med Chem Lett 11:2441-4 (2001)  
Target
Name:
Chymotrypsinogen A
Synonyms:
Alpha-chymotrypsin Chymotrypsin A Chymotrypsin A chain B Chymotrypsinogen A | alpha-Chymotrypsin (α-Chymotrypsin)
Type:
Serine protease
Mol. Mass.:
25670.88
Organism:
Bos taurus (bovine)
Description:
Residue:
245
  
Inhibitor
Name:
BDBM50104174
Synonyms:
(S)-2-Oxo-4-phenyl-3-(4-phenylazo-benzyloxycarbonylamino)-butyric acid methyl ester | CHEMBL83560
Type:
Small organic molecule
Emp. Form.:
C25H23N3O5
Mol. Mass.:
445.4672
SMILES:
COC(=O)C(=O)[C@H](Cc1ccccc1)NC(=O)OCc1ccc(cc1)N=Nc1ccccc1
: