Target
Tyrosine--tRNA ligase, cytoplasmic
Ligand
BDBM50104312
Substrate
Meas. Tech.
ChEBML_211023
IC50
>3000±n/a nM
Citation
 Jarvest, RLBerge, JMHouge-Frydrych, CSMensah, LMO'Hanlon, PJPope, AJ Inhibitors of bacterial tyrosyl tRNA synthetase: synthesis of carbocyclic analogues of the natural product SB-219383. Bioorg Med Chem Lett 11:2499-502 (2001)  
Target
Name:
Tyrosine--tRNA ligase, cytoplasmic
Synonyms:
SYYC_HUMAN YARS | YARS1
Type:
PROTEIN
Mol. Mass.:
59145.78
Organism:
Homo sapiens (Human)
Description:
ChEMBL_211030
Residue:
528
  
Inhibitor
Name:
BDBM50104312
Synonyms:
(R)-[(S)-2-Amino-3-(4-hydroxy-phenyl)-propionylamino]-((1S,2S,3S,4S)-2,3,4-trihydroxy-cyclohexyl)-acetic acid ethyl ester | CHEMBL84569
Type:
Small organic molecule
Emp. Form.:
C19H28N2O7
Mol. Mass.:
396.4348
SMILES:
CCOC(=O)[C@H](NC(=O)[C@@H](N)Cc1ccc(O)cc1)[C@@H]1CC[C@H](O)[C@H](O)[C@H]1O
: