Target
Glutamyl-tRNA(Gln) amidotransferase subunit C
Ligand
BDBM50104431
Substrate
Meas. Tech.
ChEMBL_72840 (CHEMBL684767)
IC50
>20000±n/a nM
Citation
 Decicco, CPNelson, DJLuo, YShen, LHoriuchi, KYAmsler, KMFoster, LASpitz, SMMerrill, JJSizemore, CFRogers, KCCopeland, RAHarpel, MR Glutamyl-gamma-boronate inhibitors of bacterial Glu-tRNA(Gln) amidotransferase. Bioorg Med Chem Lett 11:2561-4 (2001)  
Target
Name:
Glutamyl-tRNA(Gln) amidotransferase subunit C
Synonyms:
GATC_STRP1 | gatC
Type:
PROTEIN
Mol. Mass.:
11062.35
Organism:
Streptococcus pyogenes serotype M1
Description:
ChEMBL_72840
Residue:
100
  
Inhibitor
Name:
BDBM50104431
Synonyms:
3-((1R,5S)-5,9,9-Trimethyl-2,4-dioxa-3-bora-tricyclo[6.1.1.0*1,5*]dec-3-yl)-propylamine | CHEMBL82811
Type:
Small organic molecule
Emp. Form.:
C13H24BNO2
Mol. Mass.:
237.146
SMILES:
CC1(C)C2C[C@@]11OB(CCCN)O[C@@]1(C)CC2
: