Target
Glutamyl-tRNA(Gln) amidotransferase subunit C
Ligand
BDBM50104417
Substrate
Meas. Tech.
ChEMBL_72011 (CHEMBL681800)
IC50
>80000±n/a nM
Citation
 Decicco, CPNelson, DJLuo, YShen, LHoriuchi, KYAmsler, KMFoster, LASpitz, SMMerrill, JJSizemore, CFRogers, KCCopeland, RAHarpel, MR Glutamyl-gamma-boronate inhibitors of bacterial Glu-tRNA(Gln) amidotransferase. Bioorg Med Chem Lett 11:2561-4 (2001)  
Target
Name:
Glutamyl-tRNA(Gln) amidotransferase subunit C
Synonyms:
GATC_STRP1 | gatC
Type:
PROTEIN
Mol. Mass.:
11062.35
Organism:
Streptococcus pyogenes serotype M1
Description:
ChEMBL_72840
Residue:
100
  
Inhibitor
Name:
BDBM50104417
Synonyms:
(S)-2-Amino-4-((1R,5S)-5,9,9-trimethyl-2,4-dioxa-3-bora-tricyclo[6.1.1.0*1,5*]dec-3-yl)-butyric acid tert-butyl ester | CHEMBL419857
Type:
Small organic molecule
Emp. Form.:
C18H32BNO4
Mol. Mass.:
337.262
SMILES:
CC(C)(C)OC(=O)[C@@H](N)CCB1O[C@@]23CC(CC[C@]2(C)O1)C3(C)C
: